Promotion Clause
type: Class
alternative label: 晋升条款
subclass of: RDe0RKU39BlhcyACJW30ZLc
definition: A promotion clause is a provision in a contract that outlines the terms and conditions for an individual or entity to receive a promotion or advancement in their position or status.