WC420 Expert Witnesses
type: Class
subclass of: R6P7wyMvVTo6CR9AJqe-HSg
definition: Preparing for examination of expert witness, Interview/meeting with expert witness, Preparing for cross-examination of expert witness, Review & analysis of deposition /trial transcripts