New York Appellate Division - 2d Dept.
type: Class
subclass of: R79E394F641c4247d2dBE3ce
definition: The New York Appellate Division - 2d Dept. is a specific court within the New York Supreme Court - Appellate Division that hears appeals from lower courts in the second department of New York State.