Gondi
type: Class
alternative label: 贡迪语
subclass of: RDOvAHsvY8TKJ1O1orXPM9o
definition: Gondi (Language) is a structured system of communication that consists of grammar and vocabulary, and is a member of the Language class.