Dismissal for Failure to Prosecute
type: Class
alternative label: 未能起诉而被驳回
subclass of: RCKTvbBtse7f4CWyAp1iNdO
definition: Dismissal for Failure to Prosecute: A court order dismissing a legal case due to the plaintiff's failure to take necessary actions to move the case forward.