X400 Software License/User Access Fee
type: Class
subclass of: RYJ-vctjLRKG6Ekn5d1-frA
definition: Any software licensing or user access fees associated with subscription- or SaaS-based fees. Indicate # of users as units; if different rates depending on user type, split into multiple expense lines by rate.