Annual Information Form
type: Class
preferred label: 10-K
alternative label: Annual Financial Disclosure
subclass of: RmCERXtzdqIJcW9mdbk0Bb
definition: The Annual Information Form, also known as Form 10-K in the U.S., is an extensive disclosure document filed annually that includes a detailed account of a company's financial performance and operations. It is required by securities regulators and is intended for shareholders and potential investors.