Caselaw and Common Law
type: Class
preferred label: Caselaw
alternative label: 判例法和普通法
subclass of: RC1CZydjfH8oiM4W3rCkma3
definition: The law as established by the outcome of previously decided court cases (e.g., judicial opinions).