Legal Aid Organization
type: Class
preferred label: Legal Assistance Entity
subclass of: RMIoMi1OqwHKqsjgrjdaHj
definition: A Legal Aid Organization is a non-profit entity that provides free or low-cost legal assistance to individuals who cannot afford private legal representation. These organizations typically serve low-income clients, offering services on matters such as family law, housing, and employment issues.
example: Global Alliance for Legal Aid (GALA)
example: International Legal Aid Group (ILAG)
example: International Legal Foundation (ILF)
example: Legal Action Worldwide (LAW)
example: Legal Aid Agency (UK)
example: Legal Services Corporation
example: National Legal Aid & Defender Association (NLADA)