Presumption of Death From Absence
type: Class
alternative label: 失踪死亡推定
subclass of: R3SDQBy4KfjSgp3bgpb4Fx
definition: A legal presumption that a person is deceased when they have been absent for a certain period of time without any evidence of being alive, often used in trust and estate claims.