Trade Secret Assets
type: Class
alternative label: 商业秘密资产
subclass of: RBUBqjNCYBI4CtLUcdAVYwy
definition: Trade Secret Assets are a type of Intellectual Property Asset that refers to confidential information or knowledge that provides a competitive advantage to a person, business, or economic entity and is kept secret from the public.