Motion to Disallow Claims
type: Class
alternative label: 驳回索赔动议
subclass of: R9Ii4OzSADsjS0VegX12oQJ
definition: A Motion to Disallow Claims is a legal request made in a bankruptcy case to prevent certain claims from being considered valid or enforceable.