Invoice Currency
type: Class
alternative label: 发票货币
subclass of: RoYTC8fQGfAAw076QxHUOA
definition: Invoice Currency refers to the specific currency in which a fee invoice is issued for legal services rendered.