Laches
type: Class
subclass of: RBAoFbSK8WP6xJyVrgQd5PZ
subclass of: RCzs34uEQI9f4cuWp3bQO0P
subclass of: RDJM7d52FqDzFaBbtRdhECs
definition: Laches is a legal defense that argues that a plaintiff has unreasonably delayed in bringing a claim, causing prejudice to the defendant.