Liability to Property Trespassers
type: Class
alternative label: 对财产侵入者的责任
subclass of: RDSBerlLWg1ntpLqDQn1eVn
definition: Liability to Property Trespassers refers to the legal responsibility of a property owner for any harm caused to individuals who enter their property without permission, and the resulting legal claims that may arise in relation to such harm.