Mental Disorders
type: Class
preferred label: Psychiatric Disability
alternative label: Cognitive Disability
alternative label: Mental Disability
alternative label: Mental Impairment
subclass of: RBLzDQdY5M3AjVUpILnB95K
definition: Mental Disability, often referred to as a mental disorder or psychiatric disability, encompasses a wide range of conditions that affect an individual's thinking, feeling, behavior, or mood. These conditions can hinder daily functioning and interpersonal relations, with causes, symptoms, and treatments varying widely.