New Mexico Magistrate Court - Harding County
type: Class
subclass of: RDSK8CbOPdmMwMyMIlw8pdO
definition: A court located in Harding County, New Mexico that has limited jurisdiction over certain types of cases.