Public Benefit Coverage Objective
type: Class
comment: From LIST: Legal Issues Taxonomy — https://taxonomy.legal/
preferred label: Public Benefit Eligibility Objective
subclass of: R79ZRcChNA1jEORJLsPWYSv
definition: Public Benefit Coverage Objective refers to the goal of a legal service provider in determining client eligibility for public benefits. This can encompass various types of assistance including cash or food benefits, as well as specific healthcare services (e.g., birth control, dental care, prescriptions, optical services).