Oral Argument
type: Class
alternative label: 口头辩论
subclass of: R73Uo5x4VyfiOXt6i4R256t
definition: Oral Argument refers to a formal presentation made by attorneys to a judge or appellate court, where they argue the legal issues in a case.