Missouri Circuit Court - St. Louis County
type: Class
subclass of: RDECjssxw76vdlahxiUTb4L
definition: A Missouri Circuit Court - St. Louis County is a specific court within the Missouri Circuit Court system that has jurisdiction over legal matters within St. Louis County.