Failure to Warn
type: Class
alternative label: 未警告
subclass of: R8p15egW5el3Go9V1L4obop
definition: The failure of a manufacturer or seller to provide adequate warning or instruction about the potential dangers of a product, which can result in liability for any resulting harm or injury.