Right of Reversion Clause
type: Class
alternative label: 回转条款
subclass of: RDe0RKU39BlhcyACJW30ZLc
definition: A right of reversion clause is a provision in a contract that allows the original owner to regain ownership of the property or asset if certain conditions are met.