Pampanga; Kapampangan
type: Class
alternative label: 邦板牙语；卡帕潘甘语
subclass of: RDOvAHsvY8TKJ1O1orXPM9o
definition: A language spoken in the Philippines, specifically in the province of Pampanga, characterized by its unique grammar and vocabulary.