Stomach Cancer
type: Class
preferred label: Gastric Cancer
alternative label: Gastric Carcinoma
alternative label: Stomach Carcinoma
subclass of: R9LBsMo1i6vrjdqZMZJ3mmq
definition: Stomach cancer, also known as gastric cancer, is a type of cancer that develops from the lining of the stomach. It can spread to other parts of the body if not treated and typically requires treatments such as surgery, chemotherapy, radiation therapy, and targeted therapy.