EBITDA Bonus Clause
type: Class
alternative label: EBITDA奖金条款
subclass of: RDe0RKU39BlhcyACJW30ZLc
definition: A provision in a contract that entitles a party to receive a bonus based on the calculation of earnings before interest, taxes, depreciation, and amortization (EBITDA).