Nevada District Court
type: Class
subclass of: RF6152bC3Ba7bEB25daEC5de
definition: The Nevada District Court is a court of general jurisdiction in the state of Nevada, responsible for hearing civil and criminal cases within its jurisdictional boundaries.