X124 Publications/Books/Treatises
type: Class
subclass of: RtpnOBk4lRnWigpEBBKYUDQ
definition: Costs for any publications, books or treatises Excludes LEXIS, Westlaw or similar online legal research service (X111)