Event Postponed / Rescheduled
type: Class
alternative label: 活动延期 / 重新安排
subclass of: Rs2T4JXRBzxyj3hNAMRsoT
definition: Event Postponed / Rescheduled: A change in the scheduled date or time of an event.