New York Supreme Court - Rensselaer County
type: Class
subclass of: R06956a0657387D6513A8528
definition: New York Supreme Court - Rensselaer County: A court of general jurisdiction in the state of New York that hears civil and criminal cases within Rensselaer County.