Written Consent in Lieu of Meeting Clause
type: Class
alternative label: 会议决议书书面同意条款
subclass of: RDe0RKU39BlhcyACJW30ZLc
definition: A Written Consent in Lieu of Meeting Clause is a provision in a contract that allows the parties to give their consent to a decision without holding a formal meeting, as long as the consent is given in writing.