Pennsylvania Court of Common Pleas - Bucks County
type: Class
subclass of: Rzg8mCIjXsMzEVnQwCTKIi
definition: The Pennsylvania Court of Common Pleas - Bucks County is a specific court within the Pennsylvania Court of Common Pleas system that has jurisdiction over civil and criminal cases within Bucks County, Pennsylvania.