Furniture and Home Furnishings Retailers
type: Class
alternative label: 家具和家居用品店行业
subclass of: R8hTuQBrWujQeiTDrPH1tbQ
hidden label: FURR
definition: This industry group comprises establishments primarily engaged in retailing new furniture and home furnishings. Establishments in this industry group with fixed point-of-sale locations may operate from showrooms and have substantial areas for the presentation of their products. Establishments in this industry group may provide incidental services, including interior decorating, product assembly, installation, or repair services.