Pets Clause
type: Class
alternative label: 宠物条款
subclass of: RDe0RKU39BlhcyACJW30ZLc
definition: A Pets Clause is a provision in a contract that outlines the rights and responsibilities of pet ownership within the context of the agreement.