Hiri Motu
type: Class
alternative label: 希里莫图语
subclass of: RDOvAHsvY8TKJ1O1orXPM9o
definition: A language spoken in Papua New Guinea, characterized by a simplified grammar and vocabulary, and used in legal matters within that region.