Iron Ore Mining
type: Class
subclass of: ErwnNZdgRSKXn4MdUMtYRQ
definition: This industry comprises establishments primarily engaged in (1) developing mine sites, mining, and/or beneficiating (i.e., preparing) iron ores and manganiferous ores valued chiefly for their iron content and/or (2) producing sinter iron ore (except iron ore produced in iron and steel mills) and other iron ore agglomerates.