Transporting Stolen Property
type: Class
alternative label: 运输盗窃财物
subclass of: R7yKB3SkQ5bQZsUOV5R0jT1
definition: The act of moving or carrying property that has been unlawfully taken from its rightful owner, with the knowledge that it has been stolen.