Motion to Dismiss Single Debtor
type: Class
alternative label: 驳回单一债务人的解除申请
subclass of: R9Ii4OzSADsjS0VegX12oQJ
definition: A Motion to Dismiss Single Debtor is a legal request made by a party in a bankruptcy case to dismiss the case for a single debtor.