Merger
type: Class
alternative label: 合并
subclass of: R7Rdvjz7Q76QLZXnSJ66z40
definition: The concept of "Merger" refers to a type of M&A deal structure where two or more companies combine into a single entity, with one surviving entity and the others being absorbed.
source: ABA M&A Deal Points Study