Document Collections by Areas of Law
type: Class
alternative label: 按法律领域分类的文档集合
subclass of: RBJ4HPUl2DrL4G30lmoFKJN
definition: Document Collections by Areas of Law are a type of Transactional Document that group together various legal documents related to specific areas of law, such as Real Estate, Mergers & Acquisitions, and Trusts and Estate Planning.