Kansas District Court - Allen County
type: Class
subclass of: R8ahGaNbVpIwATBsrRg3EZp
definition: Kansas District Court - Allen County refers to a specific court within the Kansas District Court system that has jurisdiction over legal matters within Allen County.