Enterprise Search Implementation Services
type: Class
subclass of: R9EU57yyGYQyG3GeOJ1VgMr
definition: Enterprise Search Implementation Services refers to the provision of consulting and management services for the implementation of search solutions within an organization.