05_1 Prisoner Petitions: Habeas Corpus (PACER NoS)
type: Class
subclass of: RCSGywkPBv7f2ACrfTSiirV
definition: A petition filed by a person who is in custody, challenging the legality of their detention, specifically categorized under the PACER Nature of Suit (NoS) Codes as Habeas Corpus.