Misrepresentation
type: Class
alternative label: 虚假陈述
subclass of: R8jYAnNATrfoBxAtIKpf72X
definition: A misrepresentation is a false statement made by one party to another, which induces the other party to enter into a contract or take some other action, and which causes harm or damages to the other party.