Missouri Circuit Court - Perry County
type: Class
subclass of: RDECjssxw76vdlahxiUTb4L
definition: Missouri Circuit Court - Perry County: A specific court within the Missouri Circuit Court system that has jurisdiction over legal proceedings in Perry County, Missouri.