expense_item_disc_cred segment
type: Class
subclass of: RC3hDYvR4ffxmqJg2F8YGT6
definition: "All discounts, credits and Alternate Fee Agreement items applied to the parent expense line item. There will be 0 or more EXPENSE_ITEM_DISC_CRED segments per EXPENSE item. This segment excludes discounts taken at the MATTER_DISC_CRED level. Note that the EXTEND_HEADER option was purposely omitted from this segment. "