L671 Conversion of ESI to production format
type: Class
subclass of: RXWF0lWxYTqOJzmV5T5ih2g
definition: Activities and actions related to the TIFFing, bates stamping, endorsing, preparation of load files and deliverables to be provided as part of the data and/or document production(s). Also includes any technical time not included in the base production charges.