Environmental and Natural Resource Law
type: Class
alternative label: 环境和自然资源法
subclass of: RSYBzf149Mi5KE0YtmpUmr
hidden label: ENVT
definition: Law addressing environmental pollution and natural resource management.