New York Magistrate Court
type: Class
subclass of: R3391bdB1A2adE51071C7cf7
definition: New York Magistrate Court is a lower court in the New York State Court system that handles minor criminal and civil cases.