Irish
type: Class
alternative label: 爱尔兰的
subclass of: RDOvAHsvY8TKJ1O1orXPM9o
definition: Irish (Language) refers to the Goidelic language spoken in Ireland, which is one of the official languages of the country alongside English.