PA100 Assessment, Development, and Administration
type: Class
subclass of: R5JFLAJPBQOGA U3IJKipOQ
definition: All actions to investigate and understand the facts of a matter that are not included under another patent task code below. Covers interviews of client personnel and potential witnesses, review of documents to learn the facts of a potential case, work with an investigator, and all related communications and correspondence.